{"text_format":"1","workbook":"xlsx","n_sheets":3,"sheets":["Erfassungsbogen","Bezüge_Auswahlliste","CSV"],"not_rendered":{"charts":0,"images":0,"macros":1,"external_links":0,"defined_names":4,"comments":1,"pivot_tables":0},"unopened":[],"bounds":{"document_bytes":16777216,"sheet_cells":100000,"rows_first":2000,"rows_last":500,"rows_between":2000,"halvings":0,"cell_chars":16384,"cell_head_chars":4096},"cells_cut":0,"cells_raw":0,"read":"whole","date_system":"1900"}

{"sheet":"Erfassungsbogen","index":0,"n_rows":1098,"n_cols":60,"rows_kept":1098,"cut":false,"hidden":false,"merged":[[2,57,2,58],[3,41,3,43],[2,0,2,4],[2,14,2,22],[2,23,2,39],[2,40,2,56],[3,0,3,1],[3,2,3,11],[3,12,3,13],[3,14,3,17],[3,24,3,26],[3,27,3,28],[3,29,4,29],[3,34,4,34],[3,18,3,22],[3,56,4,56],[3,39,4,39],[3,44,3,45],[3,46,4,46],[3,51,4,51]]}
[]
[]
["Erfassungsbogen für Energieausweis nach der Energieeinsparverordnung (§ 16 EnEV)",null,null,null,null,null,null,null,null,null,null,null,null,null,"Die Angaben dienen der Einschätzung des Gebäudezustandes und haben Einfluss auf die Empfehlungen zu energetischen Modernisierungsmaßnahmen",null,null,null,null,null,null,null,null,"Verbrauchsdaten: Es sind die Verbrauchsdaten über mindestens 36 zusammenhängende Monate anzugeben.",null,null,null,null,null,null,null,null,null,null,null,null,null,null,null,null,"optional weitere Verbrauchsdaten (Sonstige Energieträge): Es sind die Verbrauchsdaten über mindestens 36 zusammenhängende Monate anzugeben.",null,null,null,null,null,null,null,null,null,null,null,null,null,null,null,null,"nur für Fernwärme",null,"Bemerkungen Sachbearbeiter (bitte hier eintragen)"]
["Auftraggeber Adresse:",null,null,null,null,null,null,null,null,null,null,null,"optional: Kühlung",null,"Dämmstandard/Anlagentechnik",null,null,null,"Durchgeführte energetische Modernisierungsmaßnahmen",null,null,null,null,null,"1. Verbrauchsperiode",null,null,"Wird der Energieträger auch zur Warmwasserbereitung eingesetzt?",null,"Leerstand: Fläche x Zeitraum\n[%]","2. Verbrauchsperiode",null,null,"Angabe zu Warmwasser","Leerstand: Fläche x Zeitraum\n[%]","3. Verbrauchsperiode",null,null,"Angabe zu Warmwasser","Leerstand: Fläche x Zeitraum\n[%]",null,"1. Verbrauchsperiode",null,null,"Bereitung Warmwasser mit Heizung?",null,"Leerstand: Fläche x Zeitraum\n[%]","2. Verbrauchsperiode",null,null,"Angabe Warmwasser","Leerstand: Fläche x Zeitraum\n[%]","3. Verbrauchsperiode",null,null,"Angabe Warmwasser","Leerstand: Fläche x Zeitraum\n[%]"]
["Objekt-ID","Anlass der\n Ausstellung ","PLZ","Ort","Straße","Nr.","ganze \nGebäudehülle","Baujahr \nGebäude","Wohn-\neinheiten","Wohn-\nfläche [m²]","Wohnanteil im Mischgebäude","Keller teilweise oder ganz beheizt?","Kühlung \nvorhanden?","gekühlte Fläche \n[m²]","Baujahr\nHeizungsanlage","Solaranlage","Wärmepumpe","Art der Lüftung","Jahr der Sanierung","Dämmung Dach/Decke\n","Dämmung Außenwand\n","Dämmung Kellerdecke/Fußboden\n","Fenstertausch\n [Jahr]","Energieträger","von TT.MM.JJJJ","bis TT.MM.JJJJ","Gesamtmenge\nder Periode",null,"Menge [kWh]",null,"von TT.MM.JJJJ","bis TT.MM.JJJJ","Gesamtmenge\nder Periode","Menge [kWh/a]",null,"von TT.MM.JJJJ","bis TT.MM.JJJJ","Gesamtmenge\nder Periode","Menge [kWh/a]",null,"Energieträger Heizung","von TT.MM.JJJJ","bis TT.MM.JJJJ","Gesamtmenge\nder Periode",null,"Menge [kWh/a]",null,"von TT.MM.JJJJ","bis TT.MM.JJJJ","Gesamtmenge der Periode","Menge [kWh/a]",null,"von TT.MM.JJJJ","bis TT.MM.JJJJ","Gesamtmenge der Periode","Menge [kWh/a]",null,"fp für FW\nEnergieträger 1","fp für FW\nEnergieträger 2"]
["A1005","Vermietung/Verkauf",63067,"Offenbach","Musterstr.",9,"Ja",1971,9,1063.2,"Nein","Ja","ja",120,1995,"nicht vorhanden","nicht vorhanden","Fensterlüftung",2000,"Nein","Ja","Nein",2000,"Erdgas [kWh, Brennwert]","2014-01-01","2014-12-31",98504,"Ja, pauschal",{"$f":"IF(AB6=\"Ja, Menge bekannt\",\"bitte eintragen\",\"-\")","v":"-"},null,"2015-01-01","2015-12-31",98504,{"$f":"IF(AB6=\"Ja, Menge bekannt\",\"bitte eintragen\",\"-\")","v":"-"},null,"2016-01-01","2016-12-31",98504,{"$f":"IF(AB6=\"Ja, Menge bekannt\",\"bitte eintragen\",\"-\")","v":"-"},null,null,null,null,null,"Ja, pauschal",{"$f":"IF(AS6=\"Ja, Menge bekannt\",\"bitte eintragen\",\"-\")","v":"-"},null,null,null,null,{"$f":"IF(AS6=\"Ja, Menge bekannt\",\"bitte eintragen\",\"-\")","v":"-"},null,null,null,null,{"$f":"IF(AS6=\"Ja, Menge bekannt\",\"bitte eintragen\",\"-\")","v":"-"}]
[null,null,null,null,null,null,null,null,null,null,null,null,null,null,null,null,null,null,null,null,null,null,null,null,null,null,null,null,{"$f":"IF(AB7=\"Ja, Menge bekannt\",\"bitte eintragen\",\"-\")","v":"-"},null,null,null,null,{"$f":"IF(AB7=\"Ja, Menge bekannt\",\"bitte eintragen\",\"-\")","v":"-"},null,null,null,null,{"$f":"IF(AB7=\"Ja, Menge bekannt\",\"bitte eintragen\",\"-\")","v":"-"},null,null,null,null,null,null,{"$f":"IF(AS7=\"Ja, Menge bekannt\",\"bitte eintragen\",\"-\")","v":"-"},null,null,null,null,{"$f":"IF(AS7=\"Ja, Menge bekannt\",\"bitte eintragen\",\"-\")","v":"-"},null,null,null,null,{"$f":"IF(AS7=\"Ja, Menge bekannt\",\"bitte eintragen\",\"-\")","v":"-"}]
[null,null,null,null,null,null,null,null,null,null,null,null,null,null,null,null,null,null,null,null,null,null,null,null,null,null,null,null,"-",null,null,null,null,"-",null,null,null,null,"-",null,null,null,null,null,null,"-",null,null,null,null,"-",null,null,null,null,"-"]
[null,null,null,null,null,null,null,null,null,null,null,null,null,null,null,null,null,null,null,null,null,null,null,null,null,null,null,null,"-",null,null,null,null,"-",null,null,null,null,"-",null,null,null,null,null,null,"-",null,null,null,null,"-",null,null,null,null,"-"]
[null,null,null,null,null,null,null,null,null,null,null,null,null,null,null,null,null,null,null,null,null,null,null,null,null,null,null,null,"-",null,null,null,null,"-",null,null,null,null,"-",null,null,null,null,null,null,"-",null,null,null,null,"-",null,null,null,null,"-"]
[null,null,null,null,null,null,null,null,null,null,null,null,null,null,null,null,null,null,null,null,null,null,null,null,null,null,null,null,"-",null,null,null,null,"-",null,null,null,null,"-",null,null,null,null,null,null,"-",null,null,null,null,"-",null,null,null,null,"-"]
[null,null,null,null,null,null,null,null,null,null,null,null,null,null,null,null,null,null,null,null,null,null,null,null,null,null,null,null,"-",null,null,null,null,"-",null,null,null,null,"-",null,null,null,null,null,null,"-",null,null,null,null,"-",null,null,null,null,"-"]
[null,null,null,null,null,null,null,null,null,null,null,null,null,null,null,null,null,null,null,null,null,null,null,null,null,null,null,null,"-",null,null,null,null,"-",null,null,null,null,"-",null,null,null,null,null,null,"-",null,null,null,null,"-",null,null,null,null,"-"]
[null,null,null,null,null,null,null,null,null,null,null,null,null,null,null,null,null,null,null,null,null,null,null,null,null,null,null,null,"-",null,null,null,null,"-",null,null,null,null,"-",null,null,null,null,null,null,"-",null,null,null,null,"-",null,null,null,null,"-"]
[null,null,null,null,null,null,null,null,null,null,null,null,null,null,null,null,null,null,null,null,null,null,null,null,null,null,null,null,"-",null,null,null,null,"-",null,null,null,null,"-",null,null,null,null,null,null,"-",null,null,null,null,"-",null,null,null,null,"-"]
[null,null,null,null,null,null,null,null,null,null,null,null,null,null,null,null,null,null,null,null,null,null,null,null,null,null,null,null,"-",null,null,null,null,"-",null,null,null,null,"-",null,null,null,null,null,null,"-",null,null,null,null,"-",null,null,null,null,"-"]
[null,null,null,null,null,null,null,null,null,null,null,null,null,null,null,null,null,null,null,null,null,null,null,null,null,null,null,null,"-",null,null,null,null,"-",null,null,null,null,"-",null,null,null,null,null,null,"-",null,null,null,null,"-",null,null,null,null,"-"]
[null,null,null,null,null,null,null,null,null,null,null,null,null,null,null,null,null,null,null,null,null,null,null,null,null,null,null,null,"-",null,null,null,null,"-",null,null,null,null,"-",null,null,null,null,null,null,"-",null,null,null,null,"-",null,null,null,null,"-"]
[null,null,null,null,null,null,null,null,null,null,null,null,null,null,null,null,null,null,null,null,null,null,null,null,null,null,null,null,"-",null,null,null,null,"-",null,null,null,null,"-",null,null,null,null,null,null,"-",null,null,null,null,"-",null,null,null,null,"-"]
[null,null,null,null,null,null,null,null,null,null,null,null,null,null,null,null,null,null,null,null,null,null,null,null,null,null,null,null,"-",null,null,null,null,"-",null,null,null,null,"-",null,null,null,null,null,null,"-",null,null,null,null,"-",null,null,null,null,"-"]
[null,null,null,null,null,null,null,null,null,null,null,null,null,null,null,null,null,null,null,null,null,null,null,null,null,null,null,null,"-",null,null,null,null,"-",null,null,null,null,"-",null,null,null,null,null,null,"-",null,null,null,null,"-",null,null,null,null,"-"]
[null,null,null,null,null,null,null,null,null,null,null,null,null,null,null,null,null,null,null,null,null,null,null,null,null,null,null,null,"-",null,null,null,null,"-",null,null,null,null,"-",null,null,null,null,null,null,"-",null,null,null,null,"-",null,null,null,null,"-"]
[null,null,null,null,null,null,null,null,null,null,null,null,null,null,null,null,null,null,null,null,null,null,null,null,null,null,null,null,"-",null,null,null,null,"-",null,null,null,null,"-",null,null,null,null,null,null,"-",null,null,null,null,"-",null,null,null,null,"-"]
[null,null,null,null,null,null,null,null,null,null,null,null,null,null,null,null,null,null,null,null,null,null,null,null,null,null,null,null,"-",null,null,null,null,"-",null,null,null,null,"-",null,null,null,null,null,null,"-",null,null,null,null,"-",null,null,null,null,"-"]
[null,null,null,null,null,null,null,null,null,null,null,null,null,null,null,null,null,null,null,null,null,null,null,null,null,null,null,null,"-",null,null,null,null,"-",null,null,null,null,"-",null,null,null,null,null,null,"-",null,null,null,null,"-",null,null,null,null,"-"]
[null,null,null,null,null,null,null,null,null,null,null,null,null,null,null,null,null,null,null,null,null,null,null,null,null,null,null,null,"-",null,null,null,null,"-",null,null,null,null,"-",null,null,null,null,null,null,"-",null,null,null,null,"-",null,null,null,null,"-"]
[null,null,null,null,null,null,null,null,null,null,null,null,null,null,null,null,null,null,null,null,null,null,null,null,null,null,null,null,"-",null,null,null,null,"-",null,null,null,null,"-",null,null,null,null,null,null,"-",null,null,null,null,"-",null,null,null,null,"-"]
[null,null,null,null,null,null,null,null,null,null,null,null,null,null,null,null,null,null,null,null,null,null,null,null,null,null,null,null,"-",null,null,null,null,"-",null,null,null,null,"-",null,null,null,null,null,null,"-",null,null,null,null,"-",null,null,null,null,"-"]
[null,null,null,null,null,null,null,null,null,null,null,null,null,null,null,null,null,null,null,null,null,null,null,null,null,null,null,null,"-",null,null,null,null,"-",null,null,null,null,"-",null,null,null,null,null,null,"-",null,null,null,null,"-",null,null,null,null,"-"]
[null,null,null,null,null,null,null,null,null,null,null,null,null,null,null,null,null,null,null,null,null,null,null,null,null,null,null,null,"-",null,null,null,null,"-",null,null,null,null,"-",null,null,null,null,null,null,"-",null,null,null,null,"-",null,null,null,null,"-"]
[null,null,null,null,null,null,null,null,null,null,null,null,null,null,null,null,null,null,null,null,null,null,null,null,null,null,null,null,"-",null,null,null,null,"-",null,null,null,null,"-",null,null,null,null,null,null,"-",null,null,null,null,"-",null,null,null,null,"-"]
[null,null,null,null,null,null,null,null,null,null,null,null,null,null,null,null,null,null,null,null,null,null,null,null,null,null,null,null,"-",null,null,null,null,"-",null,null,null,null,"-",null,null,null,null,null,null,"-",null,null,null,null,"-",null,null,null,null,"-"]
[null,null,null,null,null,null,null,null,null,null,null,null,null,null,null,null,null,null,null,null,null,null,null,null,null,null,null,null,"-",null,null,null,null,"-",null,null,null,null,"-",null,null,null,null,null,null,"-",null,null,null,null,"-",null,null,null,null,"-"]
[null,null,null,null,null,null,null,null,null,null,null,null,null,null,null,null,null,null,null,null,null,null,null,null,null,null,null,null,"-",null,null,null,null,"-",null,null,null,null,"-",null,null,null,null,null,null,"-",null,null,null,null,"-",null,null,null,null,"-"]
[null,null,null,null,null,null,null,null,null,null,null,null,null,null,null,null,null,null,null,null,null,null,null,null,null,null,null,null,"-",null,null,null,null,"-",null,null,null,null,"-",null,null,null,null,null,null,"-",null,null,null,null,"-",null,null,null,null,"-"]
[null,null,null,null,null,null,null,null,null,null,null,null,null,null,null,null,null,null,null,null,null,null,null,null,null,null,null,null,"-",null,null,null,null,"-",null,null,null,null,"-",null,null,null,null,null,null,"-",null,null,null,null,"-",null,null,null,null,"-"]
[null,null,null,null,null,null,null,null,null,null,null,null,null,null,null,null,null,null,null,null,null,null,null,null,null,null,null,null,"-",null,null,null,null,"-",null,null,null,null,"-",null,null,null,null,null,null,"-",null,null,null,null,"-",null,null,null,null,"-"]
[null,null,null,null,null,null,null,null,null,null,null,null,null,null,null,null,null,null,null,null,null,null,null,null,null,null,null,null,"-",null,null,null,null,"-",null,null,null,null,"-",null,null,null,null,null,null,"-",null,null,null,null,"-",null,null,null,null,"-"]
[null,null,null,null,null,null,null,null,null,null,null,null,null,null,null,null,null,null,null,null,null,null,null,null,null,null,null,null,"-",null,null,null,null,"-",null,null,null,null,"-",null,null,null,null,null,null,"-",null,null,null,null,"-",null,null,null,null,"-"]
[null,null,null,null,null,null,null,null,null,null,null,null,null,null,null,null,null,null,null,null,null,null,null,null,null,null,null,null,"-",null,null,null,null,"-",null,null,null,null,"-",null,null,null,null,null,null,"-",null,null,null,null,"-",null,null,null,null,"-"]
{"$rows_left_out":1059}
{"sheet":"Bezüge_Auswahlliste","index":1,"n_rows":1000,"n_cols":39,"rows_kept":1000,"cut":false,"hidden":true,"merged":[]}
["Auswahl ja/nein","Anlass der\nAusstellung ","Orginaldämmstandard","Heiztechnik ","Hzg_Technik\nwird nicht gebrauch","Solaranlage ","Wärmepumpe","Lüftungsart","Angaben zur Lüftung","Energieträger","Hzg_Kategorie","Angaben zum Warmwasser"]
["Ja","Vermietung/Verkauf","Normal","Standardkessel (Öl/Gas)","HZT_STD_KESSEL","nicht vorhanden","nicht vorhanden","Fensterlüftung","Fensterlüftung=1","Heizöl [l]","BK_OEL","Ja, pauschal"]
["Nein","Sonstiges","Niedrigenergie","Brennwertkessel","HZT_BW_GERAET","Warmwasserbereitung","Warmwasserbereitung","Schachtlüftung","Schachtlüftung=1","Erdgas [kWh, Brennwert]","BK_GAS","Ja, Menge bekannt"]
[null,null,"Passiv-/Nullenergie","Wärmepumpe","HZT_WP_MOTORISCH","Heizungsunterstützung","Heizungsunterstützung","Lüftungsanlage mit Wärmerückgewinnung","L_Mit_WRG=1","Flüssiggas [m³]","BK_FLUESSIGGAS","Nein, dez. Versorgung"]
[null,null,null,"Nachtspeicher/Elektroheizung","HZT_NACHTSP","Warmwasser/Heizungsunterstützung","Warmwasser/Heizungsunterstützung","Lüftungsanlage ohne Wärmerückgewinnung","L_Ohne_WRG=1","Biogas [kWh]","BK_BIOGAS"]
[null,null,null,"Ofen oder Wechselbrand","HZT_WECHSELBR",null,null,null,null,"Bioöl/Pflanzenöl [l]","BK_BIOOEL"]
[null,null,null,"Nah-/Fernheizung","HZT_FERNHZ",null,null,null,null,"Strom [kWh]","BK_STROM"]
[null,null,null,"Solarkollektor","HZT_KOLLEKTOR",null,null,null,null,"Holz [Ster]","BK_HOLZ"]
[null,null,null,"BHKW/KWK","HZT_KWK",null,null,null,null,"Holzpellets [kg]","BK_PELLET"]
[null,null,null,"Niedertemperaturkessel ","[HZT_NT_KESSEL]",null,null,null,null,"Holzhackschnitzel [kg]","BK_HHS"]
[null,null,null,"Sorptions-Gaswärmepumpe","[HZT_WP_SORPTION]",null,null,null,null,"Braunkohle [kg]","BK_BRAUNKOHLE"]
[null,null,null,"Hellstrahler","[HZT_HELLSTR]",null,null,null,null,"Steinkohle [kg]","BK_KOHLE"]
[null,null,null,"Dunkelstrahler","[HZT_DUNKELSTR]",null,null,null,null,"Fernwärme aus Heizwerken [kWh]","BK_FW0"]
[null,null,null,"Luftheizung","[HZT_LUFTHZ]",null,null,null,null,"Fernwärme (70% KWK) [kWh]","BK_FW70"]
[null,null,null,"keine Angaben","[HZT_NULL]"]
[null,null,null,"Brennstoffzelle","[HZT_FC]"]
[]
[]
[]
[]
[]
[]
[]
[]
[]
[]
[]
[]
[]
[]
[]
[]
[]
[]
[]
[]
[]
[]
[]
[]
{"$rows_left_out":961}
{"sheet":"CSV","index":2,"n_rows":2,"n_cols":71,"rows_kept":2,"cut":false,"hidden":true,"merged":[]}
["BOM","ID","Anlass","PLZ","Ort","Straße","Hausnr","isGebaeudehuelle","Baujahr","Wohneinheiten","Wohnfläche","gebaeudeteilAuto","Keller_beheizt","Klimatisiert","kuehlWfl","Hzg_Baujahr","TW_Solar","HZ_Solar","TW_WP","HZ_WP","Fensterlüftung","Schachtlüftung","L_Mit_WRG","L_Ohne_WRG","Modernisierung","Dach1_Dämmung","Wand1_Dämmung","Boden1_Dämmung","bjFensterAustausch","ETr1_Kategorie","ETr1_Jahr1_von","ETr1_Jahr1_bis","ETr1_Jahr1_Menge","ETr1_TWW","ETr1_Jahr1_Menge_TWW","ETr1_Jahr1_Leerstand","ETr1_Jahr2_von","ETr1_Jahr2_bis","ETr1_Jahr2_Menge","ETr1_Jahr2_Menge_TWW","ETr1_Jahr2_Leerstand","ETr1_Jahr3_von","ETr1_Jahr3_bis","ETr1_Jahr3_Menge","ETr1_Jahr3_Menge_TWW","ETr1_Jahr3_Leerstand","ETr1_PrimFaktor","ETr2_Kategorie","ETr2_Jahr1_von","ETr2_Jahr1_bis","ETr2_Jahr1_Menge","ETr2_TWW","ETr2_Jahr1_Menge_TWW","ETr2_Jahr1_Leerstand","ETr2_Jahr2_von","ETr2_Jahr2_bis","ETr2_Jahr2_Menge","ETr2_TWW","ETr2_Jahr2_Menge_TWW","ETr2_Jahr2_Leerstand","ETr2_Jahr3_von","ETr2_Jahr3_bis","ETr2_Jahr3_Menge","ETr2_Jahr3_Menge_TWW","ETr2_Jahr3_Leerstand","ETr1_Heizung","ETr2_Heizung","ETr2_PrimFaktor","Gebäudetyp","Datenerhebung","BedarfVerbrauch"]
[null,{"$f":"Erfassungsbogen!A6","v":"A1005"},{"$f":"IF(Erfassungsbogen!B6=\"Sonstiges\",\"AG_SONST\",\"AG_VERMIETUNG\")","v":"AG_VERMIETUNG"},{"$f":"Erfassungsbogen!C6","v":63067},{"$f":"Erfassungsbogen!D6","v":"Offenbach"},{"$f":"Erfassungsbogen!E6","v":"Musterstr."},{"$f":"Erfassungsbogen!F6","v":9},{"$f":"IF((Erfassungsbogen!G6)=\"Nein\",0,1)","v":1},{"$f":"Erfassungsbogen!H6","v":1971},{"$f":"Erfassungsbogen!I6","v":9},{"$f":"Erfassungsbogen!J6","v":1063.2},{"$f":"IF((Erfassungsbogen!K6)=\"Nein\",0,1)","v":0},{"$f":"IF((Erfassungsbogen!L6)=\"Nein\",0,1)","v":1},{"$f":"IF((Erfassungsbogen!M6)=\"Nein\",0,1)","v":1},{"$f":"Erfassungsbogen!N6","v":120},{"$f":"Erfassungsbogen!O6","v":1995},{"$f":"IF((Erfassungsbogen!P6)=\"nicht vorhanden\",0,IF((Erfassungsbogen!P6)=\"Warmwasserbereitung\",1,IF((Erfassungsbogen!P6)=\"Warmwasser/Heizungsunterstützung\",1,0)))","v":0},{"$f":"IF((Erfassungsbogen!P6)=\"nicht vorhanden\",0,IF((Erfassungsbogen!P6)=\"Heizungsunterstützung\",1,IF((Erfassungsbogen!P6)=\"Warmwasser/Heizungsunterstützung\",1,0)))","v":0},{"$f":"IF((Erfassungsbogen!Q6)=\"nicht vorhanden\",0,IF((Erfassungsbogen!Q6)=\"Warmwasserbereitung\",1,IF((Erfassungsbogen!Q6)=\"Warmwasser/Heizungsunterstützung\",1,0)))","v":0},{"$f":"IF((Erfassungsbogen!Q6)=\"nicht vorhanden\",0,IF((Erfassungsbogen!Q6)=\"Heizungsunterstützung\",1,IF((Erfassungsbogen!Q6)=\"Warmwasser/Heizungsunterstützung\",1,0)))","v":0},{"$f":"IF((Erfassungsbogen!R6)=\"Fensterlüftung\",1,0)","v":1},{"$f":"IF((Erfassungsbogen!R6)=\"Schachtlüftung\",1,0)","v":0},{"$f":"IF((Erfassungsbogen!R6)=\"Lüftungsanlage mit Wärmerückgewinnung\",1,0)","v":0},{"$f":"IF((Erfassungsbogen!R6)=\"Lüftungsanlage ohne Wärmerückgewinnung\",1,0)","v":0},{"$f":"Erfassungsbogen!S6","v":2000},{"$f":"IF((Erfassungsbogen!T6)=\"Ja\",20,0)","v":0},{"$f":"IF((Erfassungsbogen!U6)=\"Ja\",20,0)","v":20},{"$f":"IF((Erfassungsbogen!V6)=\"Ja\",20,0)","v":0},{"$f":"Erfassungsbogen!W6","v":2000},{"$f":"VLOOKUP(Erfassungsbogen!X6,Bezüge_Auswahlliste!$J$2:$K$14,2,FALSE)","v":"BK_GAS"},{"$f":"Erfassungsbogen!Y6","v":"2014-01-01"},{"$f":"Erfassungsbogen!Z6","v":"2014-12-31"},{"$f":"Erfassungsbogen!AA6","v":98504},{"$f":"IF((Erfassungsbogen!AB6)=\"Nein, dez. Versorgung\",0,1)","v":1},{"$f":"IF((Erfassungsbogen!AC6)=\"-\",\"\",Erfassungsbogen!AC6)","v":""},{"$f":"Erfassungsbogen!AD6","v":0},{"$f":"Erfassungsbogen!AE6","v":"2015-01-01"},{"$f":"Erfassungsbogen!AF6","v":"2015-12-31"},{"$f":"Erfassungsbogen!AG6","v":98504},{"$f":"IF((Erfassungsbogen!AH6)=\"-\",\"\",Erfassungsbogen!AH6)","v":""},{"$f":"Erfassungsbogen!AI6","v":0},{"$f":"Erfassungsbogen!AJ6","v":"2016-01-01"},{"$f":"Erfassungsbogen!AK6","v":"2016-12-31"},{"$f":"Erfassungsbogen!AL6","v":98504},{"$f":"IF((Erfassungsbogen!AM6)=\"-\",\"\",Erfassungsbogen!AM6)","v":""},{"$f":"Erfassungsbogen!AN6","v":0},{"$f":"Erfassungsbogen!BF6","v":0},{"$f":"VLOOKUP(Erfassungsbogen!AO6,Bezüge_Auswahlliste!$J$2:$K$14,2,FALSE)","v":{"$error":"#N/A"}},{"$f":"Erfassungsbogen!AP6","v":"00:00:00"},{"$f":"Erfassungsbogen!AQ6","v":"00:00:00"},{"$f":"Erfassungsbogen!AR6","v":0},{"$f":"IF((Erfassungsbogen!AS6)=\"Nein, dez. Versorgung\",0,1)","v":1},{"$f":"IF((Erfassungsbogen!AT6)=\"-\",\"\",Erfassungsbogen!AT6)","v":""},{"$f":"Erfassungsbogen!AU6","v":0},{"$f":"Erfassungsbogen!AV6","v":"00:00:00"},{"$f":"Erfassungsbogen!AW6","v":"00:00:00"},{"$f":"Erfassungsbogen!AX6","v":0},{"$f":"IF((Erfassungsbogen!AY6)=\"-\",\"\",Erfassungsbogen!AY6)","v":""},{"$f":"Erfassungsbogen!AZ6","v":0},{"$f":"Erfassungsbogen!AZ6","v":0},{"$f":"Erfassungsbogen!BA6","v":"00:00:00"},{"$f":"Erfassungsbogen!BB6","v":"00:00:00"},{"$f":"Erfassungsbogen!BC6","v":0},{"$f":"IF((Erfassungsbogen!BE6)=\"-\",\"\",Erfassungsbogen!BE6)","v":0},{"$f":"Erfassungsbogen!BE6","v":0},1,1,{"$f":"Erfassungsbogen!BG6","v":0},0,0,"V"]